Projects » Sympal

@29077 failed

[sfSympalPlugin] Synchronizing git repository to Symfony Plugins SVN
by Jonathan.Wage on 11 Apr 2010
Failed to build the project

Error
Build failed for project "Sympal". (return value 1)

Standard Output
[sfSympal] functional/ActionsTest....................................not ok
    Failed tests: 1, 2
[sfSympal] functional/AdminGenTest...................................not ok
    Failed tests: 1, 2
[sfSympal] functional/CommentsTest...................................not ok
    Failed tests: 0
[sfSympal] functional/ConfigurationTest..............................not ok
    Failed tests: 1, 2
[sfSympal] functional/ContentListTest................................not ok
    Failed tests: 1, 2, 4
[sfSympal] functional/InstallTest....................................ok
[sfSympal] functional/NoSympalTest...................................ok
[sfSympal] functional/RedirectsTest..................................not ok
    Failed tests: 1, 12
[sfSympal] functional/SanityCheckTest................................not ok
    Failed tests: 0
[sfSympal] functional/SitemapTest....................................ok
[sfSympal] unit/EventsTest...........................................ok
[sfSympal] unit/config/sfSympalConfigTest............................ok
[sfSympal] unit/config/sfSympalConfigurationTest.....................dubious
    Test returned status 255
    Failed tests: 0
pal] unit/sfSympalAdminPlugin/config/sfSympalAdminConfigurationTest..ok
fSympal] unit/sfSympalAssetsPlugin/model/doctrine/sfSympalAssetTest..ok
 unit/sfSympalAssetsPlugin/model/types/sfSympalAssetImageObjectTest..not ok
    Failed tests: 18
mpal] unit/sfSympalAssetsPlugin/model/types/sfSympalAssetObjectTest..ok
[sfSympal] unit/sfSympalAssetsPlugin/sfSympalAssetSyncronizerTest....not ok
    Failed tests: 4, 5
Sympal] unit/sfSympalCMFPlugin/sitemap/sfSympalSitemapGeneratorTest..ok
ympalContentListPlugin/model/doctrine/PluginsfSympalContentListTest..ok
[sfSympal] unit/sfSympalDataGridPlugin/sfSympalDataGridTest..........ok
[sfSympal] unit/sfSympalMenuPlugin/MenuTest..........................ok
[sfSympal] unit/sfSympalPluginManagerPlugin/PluginManager1Test.......dubious
    Test returned status 255
    Failed tests: 0
[sfSympal] unit/sfSympalPluginManagerPlugin/PluginManager2Test.......dubious
    Test returned status 255
    Failed tests: 0
sfSympal] unit/sfSympalRenderingPlugin/sfSympalMarkdownRendererTest..ok
ympal] unit/sfSympalRenderingPlugin/transformer/SlotTransformerTest..ok
[sfSympal] unit/user/sfSympalUserTest................................ok
[sfSympal] unit/util/sfSympalToolkitTest.............................ok
Failed Test                     Stat  Total   Fail  List of Failed
------------------------------------------------------------------
Sympal] functional/ActionsTest     0     21      2  1 2
ympal] functional/AdminGenTest     0     38      2  1 2
ympal] functional/CommentsTest     0      1      1  0
] functional/ConfigurationTest     0      5      2  1 2
al] functional/ContentListTest     0      7      3  1 2 4
mpal] functional/RedirectsTest     0     17      2  1 12
al] functional/SanityCheckTest     0      1      1  0
nfig/sfSympalConfigurationTest   255      1      1  0
s/sfSympalAssetImageObjectTest     0     21      1  18
n/sfSympalAssetSyncronizerTest     0      6      2  4 5
nagerPlugin/PluginManager1Test   255      1      1  0
nagerPlugin/PluginManager2Test   255      1      1  0
Failed 12/28 test scripts, 57.14% okay. 19/268 subtests failed, 92.91% okay.

 /tmp/sf_14_for_sympal/lib/test/sfTestFunctionalBase.class.php 
#   at /tmp/sf_14_for_sympal/lib/test/sfTestFunctionalBase.class.php line 425
>   last request threw an uncaught exception "sfConfigurationException: The route "sympal_homepage" does not exist."

#   at /tmp/sf_14_for_sympal/lib/test/sfTestFunctionalBase.class.php line 425
>   last request threw an uncaught exception "sfConfigurationException: The route "sympal_homepage" does not exist."


 /tmp/sf_14_for_sympal/lib/test/sfTestFunctionalBase.class.php 
#   at /tmp/sf_14_for_sympal/lib/test/sfTestFunctionalBase.class.php line 425
>   last request threw an uncaught exception "sfConfigurationException: The route "sympal_homepage" does not exist."

#   at /tmp/sf_14_for_sympal/lib/test/sfTestFunctionalBase.class.php line 425
>   last request threw an uncaught exception "sfConfigurationException: The route "sympal_homepage" does not exist."


 /tmp/sf_14_for_sympal/lib/test/sfTestFunctionalBase.class.php 
#   at /tmp/sf_14_for_sympal/lib/test/sfTestFunctionalBase.class.php line 425
>   last request threw an uncaught exception "sfConfigurationException: The route "sympal_homepage" does not exist."

#   at /tmp/sf_14_for_sympal/lib/test/sfTestFunctionalBase.class.php line 425
>   last request threw an uncaught exception "sfConfigurationException: The route "sympal_homepage" does not exist."


 /tmp/sf_14_for_sympal/lib/test/sfTestFunctionalBase.class.php 
#   at /tmp/sf_14_for_sympal/lib/test/sfTesterResponse.class.php line 412
>   status code is "200"
           got: 500
      expected: 200
#   at /tmp/sf_14_for_sympal/lib/test/sfTesterResponse.class.php line 238
>   response is well-formed "xml"

#   at /tmp/sf_14_for_sympal/lib/test/sfTestFunctionalBase.class.php line 425
>   last request threw an uncaught exception "sfConfigurationException: The route "sympal_homepage" does not exist."


 /tmp/sf_14_for_sympal/lib/test/sfTestFunctionalBase.class.php 
#   at /tmp/sf_14_for_sympal/lib/test/sfTestFunctionalBase.class.php line 425
>   last request threw an uncaught exception "sfConfigurationException: The route "sympal_homepage" does not exist."

#   at /tmp/sf_14_for_sympal/lib/test/sfTestFunctionalBase.class.php line 425
>   last request threw an uncaught exception "sfConfigurationException: The route "sympal_homepage" does not exist."


 [sfSympal] unit/sfSympalAssetsPlugin/model/types/sfSympalAssetImageObjectTest.php 
#   at [sfSympal] unit/sfSympalAssetsPlugin/model/types/sfSympalAssetImageObjectTest.php line 58
>   The new file does indeed exist
           got: false
      expected: true

 [sfSympal] unit/sfSympalAssetsPlugin/sfSympalAssetSyncronizerTest.php 
#   at [sfSympal] unit/sfSympalAssetsPlugin/sfSympalAssetSyncronizerTest.php line 54
>   The asset "sympalphp.png" has the correct values
           got: array (
  'name' => 'symfony-logo.gif',
  'path' => '/logos',
  'slug' => 'logos-symfony-logo',
)
      expected: array (
  'name' => 'sympalphp.png',
  'path' => '/screens',
  'slug' => 'screens-sympalphp',
)
#   at [sfSympal] unit/sfSympalAssetsPlugin/sfSympalAssetSyncronizerTest.php line 54
>   The asset "symfony-logo.gif" has the correct values
           got: array (
  'name' => 'sympalphp.png',
  'path' => '/screens',
  'slug' => 'screens-sympalphp',
)
      expected: array (
  'name' => 'symfony-logo.gif',
  'path' => '/logos',
  'slug' => 'logos-symfony-logo',
)


Standard Error